recentpopularlog in

Copy this bookmark:





to read

bookmark detail

macOS build fails by linker · Issue #82 · shundhammer/qdirstat
<code>/Applications/Developer/Xcode.app/Contents/Developer/Toolchains/XcodeDefault.xctoolchain/usr/bin/clang++ -stdlib=libc++ -headerpad_max_install_names -arch x86_64 -Wl,-syslibroot,/Applications/Developer/Xcode.app/Contents/Developer/Platforms/MacOSX.platform/Developer/SDKs/MacOSX10.14.sdk -mmacosx-version-min=10.12 -Wl,-rpath,@executable_path/../Frameworks -o .app/Contents/MacOS/ -F/opt/local/libexec/qt5/lib -framework QtGui -framework QtCore -framework DiskArbitration -framework IOKit -framework OpenGL -framework AGL
Undefined symbols for architecture x86_64:
"_main", referenced from:
implicit entry/start for main executable
ld: symbol(s) not found for architecture x86_64
clang: error: linker command failed with exit code 1 (use -v to see invocation)
make[1]: *** [.app/Contents/MacOS] Error 1
make: *** [sub-doc-make_first-ordered] Error 2</code>
build  compiler  errormessage  maybesolution  macos 
september 2019 by kme
view in context